I'm seeing a couple of test failures with master o...
# core
z
I'm seeing a couple of test failures with master on Windows. Anyone else seeing these? I see that some PRs are being merged with passing CI so I'm a bit confused as to what might be going on.
Copy code
43: [ RUN      ] FileOpsTests.test_safe_permissions
43: E:\osquery\osquery\filesystem\tests\fileops.cpp(596): error: Value of: status.ok()
43:   Actual: true
43: Expected: false
43: E:\osquery\osquery\filesystem\tests\fileops.cpp(597): error: Expected equality of these values:
43:   1
43:   status.getCode()
43:     Which is: 0
43: [  FAILED  ] FileOpsTests.test_safe_permissions (26 ms)
43: [ RUN      ] FileOpsTests.test_safe_db_permissions
43: WARNING: Logging before InitGoogleLogging() is written to STDERR
43: W0716 13:26:59.832022  8216 fileops.cpp:1166] Failed to apply safe permssions to the database
43: E:\osquery\osquery\filesystem\tests\fileops.cpp(648): error: Value of: fd.hasSafePermissions().ok()
43:   Actual: false
43: Expected: true
43: E:\osquery\osquery\filesystem\tests\fileops.cpp(649): error: Expected equality of these values:
43:   0
43:   status.getCode()
43:     Which is: 1
43: [  FAILED  ] FileOpsTests.test_safe_db_permissions (20 ms)